BDBM50172215 6-[6-(3-Carbamimidoyl-phenoxy)-3,5-difluoro-4-(1-methyl-3-phenyl-propylamino)-pyridin-2-yloxy]-N-(3-hydroxy-benzyl)-isophthalamic acid; TFA::CHEMBL193901
SMILES CC(CCc1ccccc1)Nc1c(F)c(Oc2cccc(c2)C(N)=N)nc(Oc2ccc(cc2C(O)=O)C(=O)NCc2cccc(O)c2)c1F
InChI Key InChIKey=PWCQGBMKLDFKES-UHFFFAOYSA-N
Data  2 IC50
  Tab Delimited (TSV)   2D SDfile   Computed 3D by Vconf -m prep SDfile
Find this compound or compounds like it in BindingDB:
Activity Spreadsheet -- Enzyme Inhibition Constant Data from BindingDB
Found 2 hits for monomerid = 50172215
TargetCoagulation factor X(Homo sapiens (Human))
Pfizer
Curated by ChEMBL
LigandPNGBDBM50172215(6-[6-(3-Carbamimidoyl-phenoxy)-3,5-difluoro-4-(1-m...)
Affinity DataIC50:  4.10E+3nM. Assay description: Inhibitory concentration against human coagulation factor Xa
In DepthDetails ArticlePubMed
TargetCoagulation factor VII/Tissue factor(Homo sapiens (Human))
Pfizer
Curated by ChEMBL
LigandPNGBDBM50172215(6-[6-(3-Carbamimidoyl-phenoxy)-3,5-difluoro-4-(1-m...)
Affinity DataIC50:  39nM. Assay description: Inhibitory concentration against human coagulation factor VIIa/tissue factor cleavage of fluorogenic substrate SN17c at 37 degree C for 15 minutes
In DepthDetails ArticlePubMed