BDBM50172232 2-[6-(3-Carbamimidoyl-phenoxy)-3,5-difluoro-4-(1-methyl-3-phenyl-propylamino)-pyridin-2-yloxy]-5-methylamino-benzoic acid; TFA::CHEMBL371034
SMILES CNc1ccc(Oc2nc(Oc3cccc(c3)C(N)=N)c(F)c(NC(C)CCc3ccccc3)c2F)c(c1)C(O)=O
InChI Key InChIKey=RXQYEAPFHYJVAW-UHFFFAOYSA-N
Data  2 IC50
  Tab Delimited (TSV)   2D SDfile   Computed 3D by Vconf -m prep SDfile
Find this compound or compounds like it in BindingDB:
Activity Spreadsheet -- Enzyme Inhibition Constant Data from BindingDB
Found 2 hits for monomerid = 50172232
TargetCoagulation factor X(Homo sapiens (Human))
Pfizer
Curated by ChEMBL
LigandPNGBDBM50172232(2-[6-(3-Carbamimidoyl-phenoxy)-3,5-difluoro-4-(1-m...)
Affinity DataIC50:  8.00E+3nM. Assay description: Inhibitory concentration against human coagulation factor Xa
In DepthDetails ArticlePubMed
TargetCoagulation factor VII/Tissue factor(Homo sapiens (Human))
Pfizer
Curated by ChEMBL
LigandPNGBDBM50172232(2-[6-(3-Carbamimidoyl-phenoxy)-3,5-difluoro-4-(1-m...)
Affinity DataIC50:  17nM. Assay description: Inhibitory concentration against human coagulation factor VIIa/tissue factor cleavage of fluorogenic substrate SN17c at 37 degree C for 15 minutes
In DepthDetails ArticlePubMed