BDBM50172237 6-[6-(3-Carbamimidoyl-phenoxy)-3,5-difluoro-4-(1-methyl-3-phenyl-propylamino)-pyridin-2-yloxy]-N-(3-hydroxy-propyl)-isophthalamic acid; TFA::CHEMBL194657
SMILES CC(CCc1ccccc1)Nc1c(F)c(Oc2cccc(c2)C(N)=N)nc(Oc2ccc(cc2C(O)=O)C(=O)NCCCO)c1F
InChI Key InChIKey=RIFOQQVCOGGDSG-UHFFFAOYSA-N
Data  1 IC50
  Tab Delimited (TSV)   2D SDfile   Computed 3D by Vconf -m prep SDfile
Find this compound or compounds like it in BindingDB:
Activity Spreadsheet -- Enzyme Inhibition Constant Data from BindingDB
Found 1 hit for monomerid = 50172237
TargetCoagulation factor VII/Tissue factor(Homo sapiens (Human))
Pfizer
Curated by ChEMBL
LigandPNGBDBM50172237(6-[6-(3-Carbamimidoyl-phenoxy)-3,5-difluoro-4-(1-m...)
Affinity DataIC50:  71nM. Assay description: Inhibitory concentration against human coagulation factor VIIa/tissue factor cleavage of fluorogenic substrate SN17c at 37 degree C for 15 minutes
In DepthDetails ArticlePubMed