BDBM50173919 CHEMBL3808453
SMILES CNC(=O)c1ccc2n([C@@H]3CCC[C@@H](C3)NC(=O)c3ccc(Br)s3)c(nc2c1)-c1cc[nH]n1
InChI Key InChIKey=NCATWCHZMZOKOU-LSDHHAIUSA-N
Data  1 IC50
  Tab Delimited (TSV)   2D SDfile   Computed 3D by Vconf -m prep SDfile
Find this compound or compounds like it in BindingDB:
Activity Spreadsheet -- Enzyme Inhibition Constant Data from BindingDB
Found 1 hit for monomerid = 50173919
TargetBranched-chain-amino-acid aminotransferase, mitochondrial(Homo sapiens (Human))
Glaxosmithkline
Curated by ChEMBL
LigandPNGBDBM50173919(CHEMBL3808453)
Affinity DataIC50:  2.51E+3nM. Assay description: Inhibition of human BCATm (28 to 392 residues) using L-Leucine and alpha-ketogluterate as substrate assessed as L-glutamate production after 10 mins ...
In DepthDetails ArticlePubMed