BDBM50173940 CHEMBL3809515
SMILES CNC(=O)c1ccc2n([C@@H]3CCC[C@@H](C3)NC(=O)c3cc(Br)c[nH]3)c(nc2c1)-c1ccccn1
InChI Key InChIKey=JCVJFLXUXXEFKR-ZWKOTPCHSA-N
Data  1 IC50
  Tab Delimited (TSV)   2D SDfile   Computed 3D by Vconf -m prep SDfile
Find this compound or compounds like it in BindingDB:
Activity Spreadsheet -- Enzyme Inhibition Constant Data from BindingDB
Found 1 hit for monomerid = 50173940
TargetBranched-chain-amino-acid aminotransferase, mitochondrial(Homo sapiens (Human))
Glaxosmithkline
Curated by ChEMBL
LigandPNGBDBM50173940(CHEMBL3809515)
Affinity DataIC50:  1.59E+3nM. Assay description: Inhibition of human BCATm (28 to 392 residues) using L-Leucine and alpha-ketogluterate as substrate assessed as L-glutamate production after 10 mins ...
In DepthDetails ArticlePubMed