BDBM50173946 CHEMBL3809828
SMILES NC(=O)c1ccc2n([C@@H]3CCC[C@@H](C3)NS(=O)(=O)c3ccc(Br)s3)c(nc2c1)-c1ccccn1
InChI Key InChIKey=SFFGXWBFIOHJDJ-JKSUJKDBSA-N
Data  1 IC50
  Tab Delimited (TSV)   2D SDfile   Computed 3D by Vconf -m prep SDfile
Find this compound or compounds like it in BindingDB:
Activity Spreadsheet -- Enzyme Inhibition Constant Data from BindingDB
Found 1 hit for monomerid = 50173946
TargetBranched-chain-amino-acid aminotransferase, mitochondrial(Homo sapiens (Human))
Glaxosmithkline
Curated by ChEMBL
LigandPNGBDBM50173946(CHEMBL3809828)
Affinity DataIC50:  2.00E+4nM. Assay description: Inhibition of human BCATm (28 to 392 residues) using L-Leucine and alpha-ketogluterate as substrate assessed as L-glutamate production after 10 mins ...
In DepthDetails ArticlePubMed