BDBM50174156 5,7,13-triazatetracyclo[9.3.1.02,10.04,8]pentadeca-2(10),3,5,8-tetraene::CHEMBL198490
SMILES C1C2CNCC1c1cc3[nH]cnc3cc21
InChI Key InChIKey=SPAMUHJHVULSFR-UHFFFAOYSA-N
Data  1 KI
  Tab Delimited (TSV)   2D SDfile   Computed 3D by Vconf -m prep SDfile
Find this compound or compounds like it in BindingDB:
Activity Spreadsheet -- Enzyme Inhibition Constant Data from BindingDB
Found 1 hit for monomerid = 50174156
TargetNeuronal acetylcholine receptor subunit alpha-4/beta-2(Homo sapiens (Human))
Pfizer
Curated by ChEMBL
LigandPNGBDBM50174156(5,7,13-triazatetracyclo[9.3.1.02,10.04,8]pentadeca...)
Affinity DataKi:  0.150nM. Assay description: Binding affinity for human Nicotinic acetylcholine receptor alpha4-beta2 expressed in HEK 293 cells using [3H]nicotine
In DepthDetails ArticlePubMed