BDBM50174176 7-isobutyl-5,7,13-triazatetracyclo[9.3.1.02,10.04,8]pentadeca-2(10),3,5,8-tetraene::CHEMBL197891
SMILES CC(C)Cn1cnc2cc3C4CC(CNC4)c3cc12
InChI Key InChIKey=KTCKWEYGXKJYMD-UHFFFAOYSA-N
Data  1 KI
  Tab Delimited (TSV)   2D SDfile   Computed 3D by Vconf -m prep SDfile
Find this compound or compounds like it in BindingDB:
Activity Spreadsheet -- Enzyme Inhibition Constant Data from BindingDB
Found 1 hit for monomerid = 50174176
TargetNeuronal acetylcholine receptor subunit alpha-4/beta-2(Homo sapiens (Human))
Pfizer
Curated by ChEMBL
LigandPNGBDBM50174176(7-isobutyl-5,7,13-triazatetracyclo[9.3.1.02,10.04,...)
Affinity DataKi:  0.300nM. Assay description: Binding affinity for human Nicotinic acetylcholine receptor alpha4-beta2 expressed in HEK 293 cells using [3H]nicotine
In DepthDetails ArticlePubMed