BDBM50175053 (2E)-but-2-en-1,4-diyl-bis[(aminosulfonyl)benzoate]::CHEMBL199828
SMILES NS(=O)(=O)c1ccc(cc1)C(=O)OC\C=C\COC(=O)c1ccc(cc1)S(N)(=O)=O
InChI Key InChIKey=VFHQMQJFMBSJDZ-OWOJBTEDSA-N
Data  1 KI
  Tab Delimited (TSV)   2D SDfile   Computed 3D by Vconf -m prep SDfile
Find this compound or compounds like it in BindingDB:
Activity Spreadsheet -- Enzyme Inhibition Constant Data from BindingDB
Found 1 hit for monomerid = 50175053
TargetCarbonic anhydrase 2(Bos taurus)
Griffith University
Curated by ChEMBL
LigandPNGBDBM50175053((2E)-but-2-en-1,4-diyl-bis[(aminosulfonyl)benzoate...)
Affinity DataKi:  4.90nM. Assay description: Displacement of DNSA from CAII in bovine erythrocytes
In DepthDetails ArticlePubMed