BDBM50177005 CHEMBL3813772
SMILES Cl.CCCCCCOc1ccc2cc(ccc2c1)-c1noc(n1)[C@@H]1CCCN1C(N)=N
InChI Key InChIKey=FJLFMLWYXSGNAI-BDQAORGHSA-N
Data  2 KI
  Tab Delimited (TSV)   2D SDfile   Computed 3D by Vconf -m prep SDfile
Find this compound or compounds like it in BindingDB:
Activity Spreadsheet -- Enzyme Inhibition Constant Data from BindingDB
Found 2 hits for monomerid = 50177005
TargetSphingosine kinase 2(Homo sapiens (Human))
Virginia Tech
Curated by ChEMBL
LigandPNGBDBM50177005(CHEMBL3813772)
Affinity DataKi:  3.80E+3nM. Assay description: Inhibition of human recombinant SphK2 using sphingosine as substrate incubated for 20 mins by scintillation counting analysis in presence of [gamma-3...
In DepthDetails ArticlePubMed
TargetSphingosine kinase 1(Homo sapiens (Human))
Virginia Tech
Curated by ChEMBL
LigandPNGBDBM50177005(CHEMBL3813772)
Affinity DataKi: >1.00E+4nM. Assay description: Inhibition of human recombinant SphK1 using sphingosine as substrate incubated for 20 mins by scintillation counting analysis in presence of [gamma-3...
In DepthDetails ArticlePubMed