BDBM50177557 CHEMBL380365::N-((R)-3-(4-chlorophenyl)-1-(4-(2-(diethylamino)-1-(2-fluorophenyl)ethyl)piperazin-1-yl)-1-oxopropan-2-yl)-2-(1,2,3,4-tetrahydroisoquinolin-1-yl)acetamide
SMILES CCN(CC)CC(N1CCN(CC1)C(=O)[C@@H](Cc1ccc(Cl)cc1)NC(=O)CC1NCCc2ccccc12)c1ccccc1F
InChI Key InChIKey=NSFFFSYEDFVOOT-QVGGVDQBSA-N
Data  4 KI
  Tab Delimited (TSV)   2D SDfile   Computed 3D by Vconf -m prep SDfile
Find this compound or compounds like it in BindingDB:
Activity Spreadsheet -- Enzyme Inhibition Constant Data from BindingDB
Found 4 hits for monomerid = 50177557
TargetMelanocortin receptor 4(Homo sapiens (Human))
Eli Lilly
Curated by ChEMBL
LigandPNGBDBM50177557(CHEMBL380365 | N-((R)-3-(4-chlorophenyl)-1-(4-(2-(...)
Affinity DataKi:  10nM. Assay description: Displacement of [125I]NDP-alpha-MSH from cloned human MC4R expressed in HEK293 cells
In DepthDetails ArticlePubMed
TargetMelanocortin receptor 5(Homo sapiens (Human))
Eli Lilly
Curated by ChEMBL
LigandPNGBDBM50177557(CHEMBL380365 | N-((R)-3-(4-chlorophenyl)-1-(4-(2-(...)
Affinity DataKi:  910nM. Assay description: Displacement of [125I]NDP-alpha-MSH from cloned human MC5R expressed in HEK293 cell
In DepthDetails ArticlePubMed
TargetMelanocyte-stimulating hormone receptor(Homo sapiens (Human))
Eli Lilly
Curated by ChEMBL
LigandPNGBDBM50177557(CHEMBL380365 | N-((R)-3-(4-chlorophenyl)-1-(4-(2-(...)
Affinity DataKi:  3.00E+3nM. Assay description: Displacement of [125I]NDP-alpha-MSH from cloned human MC1R expressed in HEK293 cell
In DepthDetails ArticlePubMed
TargetMelanocortin receptor 3(Homo sapiens (Human))
Eli Lilly
Curated by ChEMBL
LigandPNGBDBM50177557(CHEMBL380365 | N-((R)-3-(4-chlorophenyl)-1-(4-(2-(...)
Affinity DataKi:  4.20E+3nM. Assay description: Displacement of [125I]NDP-alpha-MSH from cloned human MC3R expressed in HEK293 cell
In DepthDetails ArticlePubMed