BDBM50178572 2-(3,5-bis(trifluoromethyl)phenyl)-N,2-dimethyl-N-(2-(4-methylpiperazin-1-yl)-5-o-tolylpyrimidin-4-yl)propanamide::CHEMBL381832
SMILES CN(C(=O)C(C)(C)c1cc(cc(c1)C(F)(F)F)C(F)(F)F)c1nc(ncc1-c1ccccc1C)N1CCN(C)CC1
InChI Key InChIKey=MHCBCPKFIVQLDP-UHFFFAOYSA-N
Data  1 KI
  Tab Delimited (TSV)   2D SDfile   Computed 3D by Vconf -m prep SDfile
Find this compound or compounds like it in BindingDB:
Activity Spreadsheet -- Enzyme Inhibition Constant Data from BindingDB
Found 1 hit for monomerid = 50178572
TargetSubstance-P receptor(Homo sapiens (Human))
F. Hoffmann-La Roche
Curated by ChEMBL
LigandPNGBDBM50178572(2-(3,5-bis(trifluoromethyl)phenyl)-N,2-dimethyl-N-...)
Affinity DataKi:  1.10nM. Assay description: Displacement of [3H]-labeled substance P from cloned human NK1 receptor expressed in CHO cells
In DepthDetails ArticlePubMed