BDBM50178622 CHEMBL277301::cis-N-(4-(4-(2-methoxyphenyl)piperazin-1-yl)butyl)-4-phenylcyclohexanecarboxamide
SMILES COc1ccccc1N1CCN(CCCCNC(=O)[C@H]2CC[C@H](CC2)c2ccccc2)CC1
InChI Key InChIKey=HBUZHZJOHCSLDL-PLQXJYEYSA-N
Data  1 KI
  Tab Delimited (TSV)   2D SDfile   Computed 3D by Vconf -m prep SDfile
Find this compound or compounds like it in BindingDB:
Activity Spreadsheet -- Enzyme Inhibition Constant Data from BindingDB
Found 1 hit for monomerid = 50178622
TargetD(3) dopamine receptor(Homo sapiens (Human))
Università
Curated by ChEMBL
LigandPNGBDBM50178622(CHEMBL277301 | cis-N-(4-(4-(2-methoxyphenyl)pipera...)
Affinity DataKi:  20.6nM. Assay description: Displacement of [3H]spiroperidol from cloned human dopamine receptor D3 in CHO cell membrane
In DepthDetails ArticlePubMed