BDBM50178826 CHEMBL437706::N-(2-methoxyphenyl)-4-(2-(2-methoxyphenylamino)pyridin-4-yl)pyridin-2-amine
SMILES COc1ccccc1Nc1cc(ccn1)-c1ccnc(Nc2ccccc2OC)c1
InChI Key InChIKey=BEJCWWBEHHBUTJ-UHFFFAOYSA-N
Data  2 IC50
  Tab Delimited (TSV)   2D SDfile   Computed 3D by Vconf -m prep SDfile
Find this compound or compounds like it in BindingDB:
Activity Spreadsheet -- Enzyme Inhibition Constant Data from BindingDB
Found 2 hits for monomerid = 50178826
TargetMitogen-activated protein kinase 10(Homo sapiens (Human))
Aureus Pharma
Curated by ChEMBL
LigandPNGBDBM50178826(CHEMBL437706 | N-(2-methoxyphenyl)-4-(2-(2-methoxy...)
Affinity DataIC50:  528nM. Assay description: Inhibition of JNK3
In DepthDetails ArticlePubMed
TargetMitogen-activated protein kinase 10(Homo sapiens (Human))
Aureus Pharma
Curated by ChEMBL
LigandPNGBDBM50178826(CHEMBL437706 | N-(2-methoxyphenyl)-4-(2-(2-methoxy...)
Affinity DataIC50:  528nM. Assay description: Inhibition of JNK3
In DepthDetails ArticlePubMed