BDBM50178848 CHEMBL205672::N-(4-fluorophenyl)-4-(2-(4-fluorophenylamino)pyridin-4-yl)pyridin-2-amine
SMILES Fc1ccc(Nc2cc(ccn2)-c2ccnc(Nc3ccc(F)cc3)c2)cc1
InChI Key InChIKey=PVQXGVSFLRLNTD-UHFFFAOYSA-N
Data  2 IC50
  Tab Delimited (TSV)   2D SDfile   Computed 3D by Vconf -m prep SDfile
Find this compound or compounds like it in BindingDB:
Activity Spreadsheet -- Enzyme Inhibition Constant Data from BindingDB
Found 2 hits for monomerid = 50178848
TargetMitogen-activated protein kinase 10(Homo sapiens (Human))
Aureus Pharma
Curated by ChEMBL
LigandPNGBDBM50178848(CHEMBL205672 | N-(4-fluorophenyl)-4-(2-(4-fluoroph...)
Affinity DataIC50:  17nM. Assay description: Inhibition of JNK3
In DepthDetails ArticlePubMed
TargetMitogen-activated protein kinase 10(Homo sapiens (Human))
Aureus Pharma
Curated by ChEMBL
LigandPNGBDBM50178848(CHEMBL205672 | N-(4-fluorophenyl)-4-(2-(4-fluoroph...)
Affinity DataIC50:  17nM. Assay description: Inhibition of JNK3
In DepthDetails ArticlePubMed