BDBM50179489 CHEMBL3814297
SMILES CCCc1cc(ccc1Oc1ccc(CCN2C(=O)NC(C)(C2=O)c2ccc(OC(C)C)cc2)c(OC)c1)C(O)(C(F)(F)F)C(F)(F)F
InChI Key InChIKey=QHZVQRNIGBTKBS-UHFFFAOYSA-N
Data  1 EC50
  Tab Delimited (TSV)   2D SDfile   Computed 3D by Vconf -m prep SDfile
Find this compound or compounds like it in BindingDB:
Activity Spreadsheet -- Enzyme Inhibition Constant Data from BindingDB
Found 1 hit for monomerid = 50179489
TargetOxysterols receptor LXR-beta(Homo sapiens (Human))
Kowa
Curated by ChEMBL
LigandPNGBDBM50179489(CHEMBL3814297)
Affinity DataEC50:  1.66E+3nM. Assay description: Agonist activity at GAL4 fused LXRbeta-LBD (unknown origin) transfected in CHOK1 cells after 24 hrs by luciferase reporter gene assay
In DepthDetails ArticlePubMed