BDBM50179509 CHEMBL2031296
SMILES CC(=O)Nc1ccc2ncnc(Nc3cccc(Br)c3)c2c1
InChI Key InChIKey=YPWGXALFLMAGJH-UHFFFAOYSA-N
Data  3 IC50
  Tab Delimited (TSV)   2D SDfile   Computed 3D by Vconf -m prep SDfile
Find this compound or compounds like it in BindingDB:
Activity Spreadsheet -- Enzyme Inhibition Constant Data from BindingDB
Found 3 hits for monomerid = 50179509
TargetEpidermal growth factor receptor(Homo sapiens (Human))
Harvard Medical School
Curated by ChEMBL
LigandPNGBDBM50179509(CHEMBL2031296)
Affinity DataIC50:  41nM. Assay description: Inhibition of wild type EGFR (unknown origin) expressed in mouse BaF/3 cells assessed as cell growth inhibition after 72 hrs by MTS assay
In DepthDetails ArticlePubMed
TargetEpidermal growth factor receptor(Homo sapiens (Human))
Harvard Medical School
Curated by ChEMBL
LigandPNGBDBM50179509(CHEMBL2031296)
Affinity DataIC50:  1nM. Assay description: Inhibition of recombinant human EGFR expressed in baculovirus by fluorescence based assay
In DepthDetails ArticlePubMed
TargetEpidermal growth factor receptor(Homo sapiens (Human))
Harvard Medical School
Curated by ChEMBL
LigandPNGBDBM50179509(CHEMBL2031296)
Affinity DataIC50:  32nM. Assay description: Inhibition of EGFR L858R mutant (unknown origin) expressed in mouse BaF/3 cells assessed as cell growth inhibition after 72 hrs by MTS assay
In DepthDetails ArticlePubMed