BDBM50180045 3-[3-(4-isobutoxybenzoyl)phenyl]propionic acid::CHEMBL198296
SMILES CC(C)COc1ccc(cc1)C(=O)c1cccc(CCC(O)=O)c1
InChI Key InChIKey=VTRPMNBIMGQGES-UHFFFAOYSA-N
Data  1 IC50
  Tab Delimited (TSV)   2D SDfile   Computed 3D by Vconf -m prep SDfile
Find this compound or compounds like it in BindingDB:
Activity Spreadsheet -- Enzyme Inhibition Constant Data from BindingDB
Found 1 hit for monomerid = 50180045
TargetProtein c-Fos/Transcription factor Jun(Homo sapiens (Human))
Toyama Chemical
Curated by ChEMBL
LigandPNGBDBM50180045(3-[3-(4-isobutoxybenzoyl)phenyl]propionic acid | C...)
Affinity DataIC50: >2.00E+6nM. Assay description: Inhibitory activity on AP1 using ELISA based AP1 DNA binding
In DepthDetails ArticlePubMed