BDBM50180618 CHEMBL3814765
SMILES OC1=C(CCC\C1=C/c1cccc(Cc2ccccc2)c1)C(=O)c1ccccc1
InChI Key InChIKey=CYROSGVHDZUUFL-LYBHJNIJSA-N
Data  1 IC50
  Tab Delimited (TSV)   2D SDfile   Computed 3D by Vconf -m prep SDfile
Find this compound or compounds like it in BindingDB:
Activity Spreadsheet -- Enzyme Inhibition Constant Data from BindingDB
Found 1 hit for monomerid = 50180618
TargetAcetylcholinesterase(Electrophorus electricus (Electric eel))
Universiti Putra Malaysia
Curated by ChEMBL
LigandPNGBDBM50180618(CHEMBL3814765)
Affinity DataIC50:  7.80E+3nM. Assay description: Inhibition of electric eel AChE preincubated for 15 mins followed by addition of acetylthiocholine iodide as substrate measured after 30 mins by Ellm...
In DepthDetails ArticlePubMed