BDBM50180642 CHEMBL3818476
SMILES CC(C)Cc1nn(C)c(=O)c2c(SCCCO)n(Cc3ccc(NCCCCCN)nc3)cc12
InChI Key InChIKey=BGTLVURPDILZRC-UHFFFAOYSA-N
Data  1 EC50
  Tab Delimited (TSV)   2D SDfile   Computed 3D by Vconf -m prep SDfile
Find this compound or compounds like it in BindingDB:
Activity Spreadsheet -- Enzyme Inhibition Constant Data from BindingDB
Found 1 hit for monomerid = 50180642
TargetMonocarboxylate transporter 1(Homo sapiens (Human))
The Scripps Research Institute
Curated by ChEMBL
LigandPNGBDBM50180642(CHEMBL3818476)
Affinity DataEC50:  420nM. Assay description: Inhibition of MCT1 in human Raji cells assessed as inhibition of cell proliferation after 96 hrs by MTT assay
In DepthDetails ArticlePubMed