BDBM50180666 CHEMBL3818472
SMILES [H][C@]12CN(NC(=O)OCc3ccccc3)C(=O)[C@]1([H])[C@@H]([C@@H](C)C=C2)C(=O)N1CCC[C@H]1C#N
InChI Key InChIKey=DWPZKCPWYCOOFY-XCZFOBESSA-N
Data  1 KI
  Tab Delimited (TSV)   2D SDfile   Computed 3D by Vconf -m prep SDfile
Find this compound or compounds like it in BindingDB:
Activity Spreadsheet -- Enzyme Inhibition Constant Data from BindingDB
Found 1 hit for monomerid = 50180666
TargetProlyl endopeptidase(Homo sapiens (Human))
Mcgill University
Curated by ChEMBL
LigandPNGBDBM50180666(CHEMBL3818472)
Affinity DataKi:  6.25E+4nM. Assay description: Inhibition of human POP expressed in Escherichia coli BL21 pre-incubated for 30 mins before ZGP-pNA substrate addition
In DepthDetails ArticlePubMed