BDBM50180675 CHEMBL3819297
SMILES [H][C@@]12CN(NC(=O)Cc3ccccc3)C(=O)[C@@]1([H])[C@H](CC=C2)C(=O)N1CCC[C@H]1C#N
InChI Key InChIKey=ZMHQINXPKRWELT-DOADOZAASA-N
Data  1 KI
  Tab Delimited (TSV)   2D SDfile   Computed 3D by Vconf -m prep SDfile
Find this compound or compounds like it in BindingDB:
Activity Spreadsheet -- Enzyme Inhibition Constant Data from BindingDB
Found 1 hit for monomerid = 50180675
TargetProlyl endopeptidase(Homo sapiens (Human))
Mcgill University
Curated by ChEMBL
LigandPNGBDBM50180675(CHEMBL3819297)
Affinity DataKi: >1.50E+5nM. Assay description: Inhibition of human POP expressed in Escherichia coli BL21 pre-incubated for 30 mins before ZGP-pNA substrate addition
In DepthDetails ArticlePubMed