BDBM50181355 2,5-dichloro-N-(7-(4-hydroxyphenyl)-5-methoxybenzo[d]oxazol-2-yl)benzenesulfonamide::CHEMBL380170
SMILES COc1cc(-c2ccc(O)cc2)c2oc(NS(=O)(=O)c3cc(Cl)ccc3Cl)nc2c1
InChI Key InChIKey=JQPBYVIEMVOUFU-UHFFFAOYSA-N
Data  1 IC50
  Tab Delimited (TSV)   2D SDfile   Computed 3D by Vconf -m prep SDfile
Find this compound or compounds like it in BindingDB:
Activity Spreadsheet -- Enzyme Inhibition Constant Data from BindingDB
Found 1 hit for monomerid = 50181355
TargetFructose-1,6-bisphosphatase 1(Homo sapiens (Human))
Abbott Laboratories
Curated by ChEMBL
LigandPNGBDBM50181355(2,5-dichloro-N-(7-(4-hydroxyphenyl)-5-methoxybenzo...)
Affinity DataIC50:  1.80E+3nM. Assay description: Inhibition of human FBPase1
In DepthDetails ArticlePubMed