BDBM50181757 4-(3-pyridylethynyl)-2-thiazolylamine::CHEMBL381031
SMILES Nc1nc(cs1)C#Cc1cccnc1
InChI Key InChIKey=BQUGCIBMYSKXRH-UHFFFAOYSA-N
Data  1 IC50
  Tab Delimited (TSV)   2D SDfile   Computed 3D by Vconf -m prep SDfile
Find this compound or compounds like it in BindingDB:
Activity Spreadsheet -- Enzyme Inhibition Constant Data from BindingDB
Found 1 hit for monomerid = 50181757
TargetMetabotropic glutamate receptor 5(Homo sapiens (Human))
University Of Illinois At Chicago
Curated by ChEMBL
LigandPNGBDBM50181757(4-(3-pyridylethynyl)-2-thiazolylamine | CHEMBL3810...)
Affinity DataIC50:  789nM. Assay description: Activity in agonist-induced phosphoinositide hydrolysis in CHO cells expressing mGluR5a
In DepthDetails ArticlePubMed