BDBM50183104 CHEMBL207479::N-(4-tert-butylthiazol-2-yl)-1H-indol-4-amine
SMILES CC(C)(C)c1csc(Nc2cccc3[nH]ccc23)n1
InChI Key InChIKey=ITGYBDHDFLFUCN-UHFFFAOYSA-N
Data  1 IC50
  Tab Delimited (TSV)   2D SDfile   Computed 3D by Vconf -m prep SDfile
Find this compound or compounds like it in BindingDB:
Activity Spreadsheet -- Enzyme Inhibition Constant Data from BindingDB
Found 1 hit for monomerid = 50183104
TargetC-C chemokine receptor type 4(Homo sapiens (Human))
Amgen
Curated by ChEMBL
LigandPNGBDBM50183104(CHEMBL207479 | N-(4-tert-butylthiazol-2-yl)-1H-ind...)
Affinity DataIC50:  490nM. Assay description: Displacement of [125I]TARC from CCR4 expressed in human CEM cell line
In DepthDetails ArticlePubMed