BDBM50183182 2''-benzyloxy-5''-chloro-[1,1';2',1'']terphenyl-3-carboxylic acid::2-Benzyloxy-5-chloro-[1,1';2',1'']terphenyl-3''-carboxylic acid::CHEMBL207174
SMILES OC(=O)c1cccc(c1)-c1ccccc1-c1cc(Cl)ccc1OCc1ccccc1
InChI Key InChIKey=LVEWBMDPAYFEFT-UHFFFAOYSA-N
Data  1 KI  3 IC50
  Tab Delimited (TSV)   2D SDfile   Computed 3D by Vconf -m prep SDfile
Find this compound or compounds like it in BindingDB:
Activity Spreadsheet -- Enzyme Inhibition Constant Data from BindingDB
Found 4 hits for monomerid = 50183182
TargetProstaglandin E2 receptor EP1 subtype(Homo sapiens (Human))
Glaxosmithkline
Curated by ChEMBL
LigandPNGBDBM50183182(2''-benzyloxy-5''-chloro-[1,1';2',1'']terphenyl-3-...)
Affinity DataKi:  31.6nM. Assay description: Antagonist activity at EP1 receptor assessed as calcium mobilization by FLIPR assay
In DepthDetails ArticlePubMed
TargetProstaglandin E2 receptor EP1 subtype(Homo sapiens (Human))
Glaxosmithkline
Curated by ChEMBL
LigandPNGBDBM50183182(2''-benzyloxy-5''-chloro-[1,1';2',1'']terphenyl-3-...)
Affinity DataIC50:  50.1nM. Assay description: Displacement of [3H]PGE2 from EP1 receptor
In DepthDetails ArticlePubMed
TargetCytochrome P450 2C9(Homo sapiens (Human))
Glaxosmithkline
Curated by ChEMBL
LigandPNGBDBM50183182(2''-benzyloxy-5''-chloro-[1,1';2',1'']terphenyl-3-...)
Affinity DataIC50:  3.90E+3nM. Assay description: Inhibition of CYP450 2C9
In DepthDetails ArticlePubMed
TargetProstaglandin E2 receptor EP1 subtype(Homo sapiens (Human))
Glaxosmithkline
Curated by ChEMBL
LigandPNGBDBM50183182(2''-benzyloxy-5''-chloro-[1,1';2',1'']terphenyl-3-...)
Affinity DataIC50:  50.1nM. Assay description: Binding affinity to EP1 receptor
In DepthDetails ArticlePubMed