BDBM50183291 CHEMBL205117::N-(4-(1,1,1,3,3,3-hexafluoro-2-hydroxypropan-2-yl)phenyl)-N-phenethylmorpholine-4-carboxamide::morpholine-4-carboxylic acid phenethyl-[4-(2,2,2-trifluoro-1-hydroxy-1-trifluoromethylethyl)phenyl]amide
SMILES OC(c1ccc(cc1)N(CCc1ccccc1)C(=O)N1CCOCC1)(C(F)(F)F)C(F)(F)F
InChI Key InChIKey=RYZQCXZUKJQLBT-UHFFFAOYSA-N
Data  2 IC50
  Tab Delimited (TSV)   2D SDfile   Computed 3D by Vconf -m prep SDfile
Find this compound or compounds like it in BindingDB:
Activity Spreadsheet -- Enzyme Inhibition Constant Data from BindingDB
Found 2 hits for monomerid = 50183291
TargetMalonyl-CoA decarboxylase, mitochondrial(Homo sapiens (Human))
St. John'S University
Curated by ChEMBL
LigandPNGBDBM50183291(CHEMBL205117 | N-(4-(1,1,1,3,3,3-hexafluoro-2-hydr...)
Affinity DataIC50:  43nM. Assay description: Inhibition of human recombinant MCD
In DepthDetails ArticlePubMed
TargetMalonyl-CoA decarboxylase, mitochondrial(Homo sapiens (Human))
St. John'S University
Curated by ChEMBL
LigandPNGBDBM50183291(CHEMBL205117 | N-(4-(1,1,1,3,3,3-hexafluoro-2-hydr...)
Affinity DataIC50:  43nM. Assay description: Inhibition of MCD
In DepthDetails ArticlePubMed