BDBM50183333 CHEMBL205719::N-heptyl-N-(4-(1,1,1,3,3,3-hexafluoro-2-hydroxypropan-2-yl)phenyl)morpholine-4-carboxamide::morpholine-4-carboxylic acid heptyl-[4-(2,2,2-trifluoro-1-hydroxy-1-trifluoromethylethyl)phenyl]amide
SMILES CCCCCCCN(C(=O)N1CCOCC1)c1ccc(cc1)C(O)(C(F)(F)F)C(F)(F)F
InChI Key InChIKey=RHLSJKFNBOLRBL-UHFFFAOYSA-N
Data  2 IC50
  Tab Delimited (TSV)   2D SDfile   Computed 3D by Vconf -m prep SDfile
Find this compound or compounds like it in BindingDB:
Activity Spreadsheet -- Enzyme Inhibition Constant Data from BindingDB
Found 2 hits for monomerid = 50183333
TargetMalonyl-CoA decarboxylase, mitochondrial(Homo sapiens (Human))
St. John'S University
Curated by ChEMBL
LigandPNGBDBM50183333(CHEMBL205719 | N-heptyl-N-(4-(1,1,1,3,3,3-hexafluo...)
Affinity DataIC50:  72nM. Assay description: Inhibition of human recombinant MCD
In DepthDetails ArticlePubMed
TargetMalonyl-CoA decarboxylase, mitochondrial(Homo sapiens (Human))
St. John'S University
Curated by ChEMBL
LigandPNGBDBM50183333(CHEMBL205719 | N-heptyl-N-(4-(1,1,1,3,3,3-hexafluo...)
Affinity DataIC50:  73nM. Assay description: Inhibition of MCD
In DepthDetails ArticlePubMed