BDBM50185197 11-methyl-6,11-dihydro-5H-pyrido[3,2-a]carbazol-8-ol::CHEMBL379527
SMILES Cn1c-2c(CCc3ncccc-23)c2cc(O)ccc12
InChI Key InChIKey=HFBFCDLZAKZWOX-UHFFFAOYSA-N
Data  2 IC50
  Tab Delimited (TSV)   2D SDfile   Computed 3D by Vconf -m prep SDfile
Find this compound or compounds like it in BindingDB:
Activity Spreadsheet -- Enzyme Inhibition Constant Data from BindingDB
Found 2 hits for monomerid = 50185197
TargetAndrogen receptor(Rattus norvegicus (Rat))
University Of Michigan
Curated by ChEMBL
LigandPNGBDBM50185197(11-methyl-6,11-dihydro-5H-pyrido[3,2-a]carbazol-8-...)
Affinity DataIC50:  29nM. Assay description: Binding affinity to rat Androgen receptor in African green monkey COS-7 cells measured by whole-cell binding assay
In DepthDetails PubMed
TargetAndrogen receptor(Rattus norvegicus (Rat))
University Of Michigan
Curated by ChEMBL
LigandPNGBDBM50185197(11-methyl-6,11-dihydro-5H-pyrido[3,2-a]carbazol-8-...)
Affinity DataIC50:  29nM. Assay description: Inhibition of rat AR-mediated reporter gene expression in COS7 cells
In DepthDetails ArticlePubMed