BDBM50185201 11-methyl-6,11-dihydrothiochromeno[4,3-b]indol-8-yl acetate::CHEMBL207510
SMILES CC(=O)Oc1ccc2n(C)c-3c(CSc4ccccc-34)c2c1
InChI Key InChIKey=QPEDEGUPTWDSJM-UHFFFAOYSA-N
Data  1 IC50
  Tab Delimited (TSV)   2D SDfile   Computed 3D by Vconf -m prep SDfile
Find this compound or compounds like it in BindingDB:
Activity Spreadsheet -- Enzyme Inhibition Constant Data from BindingDB
Found 1 hit for monomerid = 50185201
TargetAndrogen receptor(Rattus norvegicus (Rat))
Johnson & Johnson Pharmaceutical Research And Development
Curated by ChEMBL
LigandPNGBDBM50185201(11-methyl-6,11-dihydrothiochromeno[4,3-b]indol-8-y...)
Affinity DataIC50:  880nM. Assay description: Inhibition of rat AR-mediated reporter gene expression in COS7 cells
In DepthDetails ArticlePubMed