BDBM50185202 3,10-dimethyl-3,4,5,10-tetrahydropyrrolo[3,2-a]carbazol-7-ol::CHEMBL382640
SMILES Cn1ccc-2c1CCc1c-2n(C)c2ccc(O)cc12
InChI Key InChIKey=AXALKVNWVAZIMU-UHFFFAOYSA-N
Data  1 IC50
  Tab Delimited (TSV)   2D SDfile   Computed 3D by Vconf -m prep SDfile
Find this compound or compounds like it in BindingDB:
Activity Spreadsheet -- Enzyme Inhibition Constant Data from BindingDB
Found 1 hit for monomerid = 50185202
TargetAndrogen receptor(Rattus norvegicus (Rat))
Johnson & Johnson Pharmaceutical Research And Development
Curated by ChEMBL
LigandPNGBDBM50185202(3,10-dimethyl-3,4,5,10-tetrahydropyrrolo[3,2-a]car...)
Affinity DataIC50:  370nM. Assay description: Inhibition of rat AR-mediated reporter gene expression in COS7 cells
In DepthDetails ArticlePubMed