BDBM50185214 (S)-3-(1H-benzo[d]imidazol-2-yl)-8-methyl-4-(quinuclidin-3-ylamino)quinolin-2(1H)-one::CHEMBL377609
SMILES Cc1cccc2c(N[C@@H]3CN4CCC3CC4)c(-c3nc4ccccc4[nH]3)c(=O)[nH]c12
InChI Key InChIKey=GTFOOISGIRJTSX-LJQANCHMSA-N
Data  1 IC50
  Tab Delimited (TSV)   2D SDfile   Computed 3D by Vconf -m prep SDfile
Find this compound or compounds like it in BindingDB:
Activity Spreadsheet -- Enzyme Inhibition Constant Data from BindingDB
Found 1 hit for monomerid = 50185214
TargetSerine/threonine-protein kinase Chk1(Homo sapiens (Human))
Chiron
Curated by ChEMBL
LigandPNGBDBM50185214((S)-3-(1H-benzo[d]imidazol-2-yl)-8-methyl-4-(quinu...)
Affinity DataIC50:  138nM. Assay description: Inhibition of CHK1
In DepthDetails ArticlePubMed