BDBM50185935 3-ureido-5-(6-(3-iodobenzylamino)purin-9-yl)-4-hydroxy-tetrahydro-furan-2-carboxylic acid methyl amide::CHEMBL206085
SMILES CNC(=O)[C@H]1O[C@H]([C@H](O)[C@@H]1NC(N)=O)n1cnc2c(NCc3cccc(I)c3)ncnc12
InChI Key InChIKey=MOFHRCSJJXUHRR-MHMFGPJMSA-N
Data  1 KI
  Tab Delimited (TSV)   2D SDfile   Computed 3D by Vconf -m prep SDfile
Find this compound or compounds like it in BindingDB:
Activity Spreadsheet -- Enzyme Inhibition Constant Data from BindingDB
Found 1 hit for monomerid = 50185935
TargetAdenosine receptor A3(Homo sapiens (Human))
National Institute Of Diabetes And Digestive And Kidney Diseases
Curated by ChEMBL
LigandPNGBDBM50185935(3-ureido-5-(6-(3-iodobenzylamino)purin-9-yl)-4-hyd...)
Affinity DataKi:  2.70E+3nM. Assay description: Displacement of [125I]I-AB-MECA from human adenosine A3 receptor H272E mutant expressed in COS7 cells
In DepthDetails ArticlePubMed