BDBM50186436 (S)-methyl 2-(3-(4-hydroxyphenyl)-4,5-dihydroisoxazol-5-yl)acetate::CHEMBL209822
SMILES COC(=O)C[C@@H]1CC(=NO1)c1ccc(O)cc1
InChI Key InChIKey=AIXMJTYHQHQJLU-JTQLQIEISA-N
Data  1 IC50
  Tab Delimited (TSV)   2D SDfile   Computed 3D by Vconf -m prep SDfile
Find this compound or compounds like it in BindingDB:
Activity Spreadsheet -- Enzyme Inhibition Constant Data from BindingDB
Found 1 hit for monomerid = 50186436
TargetMacrophage migration inhibitory factor(Homo sapiens (Human))
Institute For Medical Research
Curated by ChEMBL
LigandPNGBDBM50186436((S)-methyl 2-(3-(4-hydroxyphenyl)-4,5-dihydroisoxa...)
Affinity DataIC50:  1.30E+4nM. Assay description: Inhibition of MIF tautomerase activity
In DepthDetails ArticlePubMed