BDBM50186731 CHEMBL3823752
SMILES CCCCCCCCC[C@@H](OC(=O)CCCCCCC)[C@@H](C)O
InChI Key InChIKey=JRSNXAQLASDXMJ-RTBURBONSA-N
Data  1 KI
  Tab Delimited (TSV)   2D SDfile   Computed 3D by Vconf -m prep SDfile
Find this compound or compounds like it in BindingDB:
Activity Spreadsheet -- Enzyme Inhibition Constant Data from BindingDB
Found 1 hit for monomerid = 50186731
TargetProtein kinase C delta type(Mus musculus)
Ehime University
Curated by ChEMBL
LigandPNGBDBM50186731(CHEMBL3823752)
Affinity DataKi: >2.00E+4nM. Assay description: Inhibition of [3H]PDBu binding to PKCdelta C1B domain in CD-1 mouse brain cytosol incubated for 30 mins
In DepthDetails ArticlePubMed