BDBM50187256 CHEMBL377886::naphth-1-yl-carbamic acid 1-[(2-hydroxy-5-oxo-tetrahydro-furan-3(S)-ylcarbamoyl)-methyl]-2-oxo-5-phenyl-2,3-dihydro-1H-benzo[e][1,4]diazepin-3(R)-ylmethyl ester
SMILES OC1OC(=O)C[C@@H]1NC(=O)CN1c2ccccc2C(=N[C@H](COC(=O)Nc2cccc3ccccc23)C1=O)c1ccccc1
InChI Key InChIKey=ZOMRMWPDDSFNMK-YNYZQZDBSA-N
Data  2 IC50
  Tab Delimited (TSV)   2D SDfile   Computed 3D by Vconf -m prep SDfile
Find this compound or compounds like it in BindingDB:
Activity Spreadsheet -- Enzyme Inhibition Constant Data from BindingDB
Found 2 hits for monomerid = 50187256
TargetFalcipain 2(Plasmodium falciparum)
University Of Messina
Curated by ChEMBL
LigandPNGBDBM50187256(CHEMBL377886 | naphth-1-yl-carbamic acid 1-[(2-hyd...)
Affinity DataIC50:  1.12E+4nM. Assay description: Inhibition of Plasmodium falciparum recombinant FP2A fused with maltose binding protein
In DepthDetails ArticlePubMed
TargetFalcipain 2B(Plasmodium falciparum)
University Of Messina
Curated by ChEMBL
LigandPNGBDBM50187256(CHEMBL377886 | naphth-1-yl-carbamic acid 1-[(2-hyd...)
Affinity DataIC50:  1.79E+4nM. Assay description: Inhibition of Plasmodium falciparum recombinant FP2B fused with maltose binding protein
In DepthDetails ArticlePubMed