BDBM50187701 CHEMBL3827395
SMILES Nc1ncnc2C(C=Nc12)[C@@H]1N[C@H](CO)[C@@H](O)[C@H]1O
InChI Key InChIKey=FPUDHSLOMSUPIB-PFLDWWEXSA-N
Data  2 KI
  Tab Delimited (TSV)   2D SDfile   Computed 3D by Vconf -m prep SDfile
Find this compound or compounds like it in BindingDB:
Activity Spreadsheet -- Enzyme Inhibition Constant Data from BindingDB
Found 2 hits for monomerid = 50187701
TargetInosine-adenosine-guanosine-nucleoside hydrolase(Trypanosoma brucei brucei)
Medical University Of Lodz
Curated by ChEMBL
LigandPNGBDBM50187701(CHEMBL3827395)
Affinity DataKi:  3nM. Assay description: Inhibition of Trypanosoma brucei brucei inosine-adenosine-guanosine nucleoside hydrolase expressed in Escherichia coli
In DepthDetails ArticlePubMed
TargetInosine-uridine preferring nucleoside hydrolase(Crithidia fasciculata)
Medical University Of Lodz
Curated by ChEMBL
LigandPNGBDBM50187701(CHEMBL3827395)
Affinity DataKi:  7nM. Assay description: Inhibition of Crithidia fasciculata inosine-uridine nucleoside hydrolase expressed in Escherichia coli using p-nitrophenyl beta-D-ribofuranoside as s...
In DepthDetails ArticlePubMed