BDBM50187769 7-(4-fluorobenzyl)-5-hydroxy-9-methoxy-7,8-dihydropyrrolo[3,4-g]quinoxalin-6-one::CHEMBL209488
SMILES COc1c2CN(Cc3ccc(F)cc3)C(=O)c2c(O)c2nccnc12
InChI Key InChIKey=BAJWLNLSCCLHBD-UHFFFAOYSA-N
Data  1 IC50
  Tab Delimited (TSV)   2D SDfile   Computed 3D by Vconf -m prep SDfile
Find this compound or compounds like it in BindingDB:
Activity Spreadsheet -- Enzyme Inhibition Constant Data from BindingDB
Found 1 hit for monomerid = 50187769
TargetIntegrase(Human immunodeficiency virus 1)
Gilead Sciences
Curated by ChEMBL
LigandPNGBDBM50187769(7-(4-fluorobenzyl)-5-hydroxy-9-methoxy-7,8-dihydro...)
Affinity DataIC50:  210nM. Assay description: Inhibition of strand transfer activity in HIV1 integrase
In DepthDetails ArticlePubMed