BDBM50187896 CHEMBL377666::N-(2-amino-2-methylpropyl)-N-(1-(3-benzyl-4-oxo-3,4-dihydropyrrolo[1,2-f][1,2,4]triazin-2-yl)propyl)-4-chlorobenzamide
SMILES CCC(N(CC(C)(C)N)C(=O)c1ccc(Cl)cc1)c1nn2cccc2c(=O)n1Cc1ccccc1
InChI Key InChIKey=STFZGEHJBDMPNV-UHFFFAOYSA-N
Data  1 IC50
  Tab Delimited (TSV)   2D SDfile   Computed 3D by Vconf -m prep SDfile
Find this compound or compounds like it in BindingDB:
Activity Spreadsheet -- Enzyme Inhibition Constant Data from BindingDB
Found 1 hit for monomerid = 50187896
TargetKinesin-like protein KIF11(Homo sapiens (Human))
Bristol-Myers Squibb Pharmaceutical Research Institute
Curated by ChEMBL
LigandPNGBDBM50187896(CHEMBL377666 | N-(2-amino-2-methylpropyl)-N-(1-(3-...)
Affinity DataIC50:  3.72E+3nM. Assay description: Inhibition of human Eg5 ATPase activity
In DepthDetails ArticlePubMed