BDBM50187900 CHEMBL213686::N-(3-aminopropyl)-N-(1-(3-benzyl-7-chloro-4-oxo-3,4-dihydropyrrolo[1,2-f][1,2,4]triazin-2-yl)propyl)-4-methylbenzamide
SMILES CCC(N(CCCN)C(=O)c1ccc(C)cc1)c1nn2c(Cl)ccc2c(=O)n1Cc1ccccc1
InChI Key InChIKey=YKYLFOAUDQVKCU-UHFFFAOYSA-N
Data  1 IC50
  Tab Delimited (TSV)   2D SDfile   Computed 3D by Vconf -m prep SDfile
Find this compound or compounds like it in BindingDB:
Activity Spreadsheet -- Enzyme Inhibition Constant Data from BindingDB
Found 1 hit for monomerid = 50187900
TargetKinesin-like protein KIF11(Homo sapiens (Human))
Bristol-Myers Squibb Pharmaceutical Research Institute
Curated by ChEMBL
LigandPNGBDBM50187900(CHEMBL213686 | N-(3-aminopropyl)-N-(1-(3-benzyl-7-...)
Affinity DataIC50:  60nM. Assay description: Inhibition of human Eg5 ATPase activity
In DepthDetails ArticlePubMed