BDBM50187906 CHEMBL210067::N-(3-aminopropyl)-N-(1-(3-benzyl-6-chloro-4-oxo-3,4-dihydropyrrolo[1,2-f][1,2,4]triazin-2-yl)propyl)-4-methylbenzamide
SMILES CCC(N(CCCN)C(=O)c1ccc(C)cc1)c1nn2cc(Cl)cc2c(=O)n1Cc1ccccc1
InChI Key InChIKey=HLMSMLBYLICYCM-UHFFFAOYSA-N
Data  1 IC50
  Tab Delimited (TSV)   2D SDfile   Computed 3D by Vconf -m prep SDfile
Find this compound or compounds like it in BindingDB:
Activity Spreadsheet -- Enzyme Inhibition Constant Data from BindingDB
Found 1 hit for monomerid = 50187906
TargetKinesin-like protein KIF11(Homo sapiens (Human))
Bristol-Myers Squibb Pharmaceutical Research Institute
Curated by ChEMBL
LigandPNGBDBM50187906(CHEMBL210067 | N-(3-aminopropyl)-N-(1-(3-benzyl-6-...)
Affinity DataIC50:  330nM. Assay description: Inhibition of human Eg5 ATPase activity
In DepthDetails ArticlePubMed