BDBM50187926 1-(3-(3-(pyrrolidin-1-yl)propoxy)phenyl)-3-(3-(trifluoromethyl)phenylimino)indolin-2-one::CHEMBL211031
SMILES FC(F)(F)c1cccc(c1)\N=C1\C(=O)N(c2ccccc12)c1cccc(OCCCN2CCCC2)c1
InChI Key InChIKey=NUADTUZMPQSMJY-HMZBKAONSA-N
Data  1 KI
  Tab Delimited (TSV)   2D SDfile   Computed 3D by Vconf -m prep SDfile
Find this compound or compounds like it in BindingDB:
Activity Spreadsheet -- Enzyme Inhibition Constant Data from BindingDB
Found 1 hit for monomerid = 50187926
TargetGalanin receptor type 3(Homo sapiens (Human))
Lundbeck Research Usa
Curated by ChEMBL
LigandPNGBDBM50187926(1-(3-(3-(pyrrolidin-1-yl)propoxy)phenyl)-3-(3-(tri...)
Affinity DataKi:  49nM. Assay description: Displacement of [125I]galanin from human galanin Gal3 receptor
In DepthDetails ArticlePubMed