BDBM50188129 (3aS,8R,8aS)-5,6-dichloro-8-methyl-1,2,3,3a,8,8a-hexahydro-indeno[1,2-c]pyrrole::CHEMBL213590
SMILES C[C@@H]1[C@@H]2CNC[C@@H]2c2cc(Cl)c(Cl)cc12
InChI Key InChIKey=VRECLQQMMYLGAN-JMOVZRAMSA-N
Data  1 KI
  Tab Delimited (TSV)   2D SDfile   Computed 3D by Vconf -m prep SDfile
Find this compound or compounds like it in BindingDB:
Activity Spreadsheet -- Enzyme Inhibition Constant Data from BindingDB
Found 1 hit for monomerid = 50188129
Target5-hydroxytryptamine receptor 2C(Homo sapiens (Human))
Athersys
Curated by ChEMBL
LigandPNGBDBM50188129((3aS,8R,8aS)-5,6-dichloro-8-methyl-1,2,3,3a,8,8a-h...)
Affinity DataKi:  155nM. Assay description: Binding affinity to 5HT2C
In DepthDetails ArticlePubMed