BDBM50188136 (3aS,8R,8aS)-6,7-dichloro-8-methyl-1,2,3,3a,8,8a-hexahydro-indeno[1,2-c]pyrrole::CHEMBL441531
SMILES C[C@@H]1[C@@H]2CNC[C@@H]2c2ccc(Cl)c(Cl)c12
InChI Key InChIKey=OAZZLOFRPKQVFH-BWVDBABLSA-N
Data  1 KI
  Tab Delimited (TSV)   2D SDfile   Computed 3D by Vconf -m prep SDfile
Find this compound or compounds like it in BindingDB:
Activity Spreadsheet -- Enzyme Inhibition Constant Data from BindingDB
Found 1 hit for monomerid = 50188136
Target5-hydroxytryptamine receptor 2C(Homo sapiens (Human))
Athersys
Curated by ChEMBL
LigandPNGBDBM50188136((3aS,8R,8aS)-6,7-dichloro-8-methyl-1,2,3,3a,8,8a-h...)
Affinity DataKi:  5nM. Assay description: Binding affinity to 5HT2C
In DepthDetails ArticlePubMed