BDBM50188158 (4S,7S,10S,13S,16S,17R)-16-({[(2S)-1-amino-3-(4-hydroxyphenyl)propan-2-yl]amino}methyl)-10,13-dibenzyl-4,7-bis[(4-hydroxyphenyl)methyl]-3,6,9,12,15-pentaazaoctadecan-17-ol::CHEMBL375136
SMILES CCN[C@H](CN[C@H](CN[C@H](CN[C@H](CN[C@@H](CN[C@H](CN)Cc1ccc(O)cc1)[C@@H](C)O)Cc1ccccc1)Cc1ccccc1)Cc1ccc(O)cc1)Cc1ccc(O)cc1
InChI Key InChIKey=KXAYNAAYIPLSQX-WRXFOYDJSA-N
Data  1 IC50
  Tab Delimited (TSV)   2D SDfile   Computed 3D by Vconf -m prep SDfile
Find this compound or compounds like it in BindingDB:
Activity Spreadsheet -- Enzyme Inhibition Constant Data from BindingDB
Found 1 hit for monomerid = 50188158
TargetMu-type opioid receptor(Rattus norvegicus (rat))
Institute For Molecular Studies
Curated by ChEMBL
LigandPNGBDBM50188158((4S,7S,10S,13S,16S,17R)-16-({[(2S)-1-amino-3-(4-hy...)
Affinity DataIC50:  78nM. Assay description: Displacement of [3H]DAMGO from mu opioid receptor in rat brain homogenate
In DepthDetails ArticlePubMed