BDBM50188173 4-[(2S)-3-{[(2S)-1-{[(2S)-1-[(2S)-2-({[(2S,3R)-1-{[(2S)-1-amino-3-hydroxypropan-2-yl]amino}-3-hydroxybutan-2-yl]amino}methyl)pyrrolidin-1-yl]-3-(4-hydroxyphenyl)propan-2-yl]amino}-3-(4-hydroxyphenyl)propan-2-yl]amino}-2-(ethylamino)propyl]phenol::CHEMBL385376
SMILES CCN[C@H](CN[C@H](CN[C@H](CN1CCC[C@H]1CN[C@@H](CN[C@@H](CN)CO)[C@@H](C)O)Cc1ccc(O)cc1)Cc1ccc(O)cc1)Cc1ccc(O)cc1
InChI Key InChIKey=ZMBFGNNIOJTVFQ-OKDRNNFPSA-N
Data  1 IC50
  Tab Delimited (TSV)   2D SDfile   Computed 3D by Vconf -m prep SDfile
Find this compound or compounds like it in BindingDB:
Activity Spreadsheet -- Enzyme Inhibition Constant Data from BindingDB
Found 1 hit for monomerid = 50188173
TargetMu-type opioid receptor(Rattus norvegicus (rat))
Institute For Molecular Studies
Curated by ChEMBL
LigandPNGBDBM50188173(4-[(2S)-3-{[(2S)-1-{[(2S)-1-[(2S)-2-({[(2S,3R)-1-{...)
Affinity DataIC50:  32nM. Assay description: Displacement of [3H]DAMGO from mu opioid receptor in rat brain homogenate
In DepthDetails ArticlePubMed