BDBM50188185 (4S,7S,10S,13S,16S,17R)-16-{[(2S)-2-(aminomethyl)pyrrolidin-1-yl]methyl}-13-benzyl-4,7,10-tris[(4-hydroxyphenyl)methyl]-3,6,9,12,15-pentaazaoctadecan-17-ol::CHEMBL402882
SMILES CCN[C@H](CN[C@H](CN[C@H](CN[C@H](CN[C@@H](CN1CCC[C@H]1CN)[C@@H](C)O)Cc1ccccc1)Cc1ccc(O)cc1)Cc1ccc(O)cc1)Cc1ccc(O)cc1
InChI Key InChIKey=NOACCCKHROQXEG-PVUMIAEYSA-N
Data  1 IC50
  Tab Delimited (TSV)   2D SDfile   Computed 3D by Vconf -m prep SDfile
Find this compound or compounds like it in BindingDB:
Activity Spreadsheet -- Enzyme Inhibition Constant Data from BindingDB
Found 1 hit for monomerid = 50188185
TargetMu-type opioid receptor(Rattus norvegicus (rat))
Institute For Molecular Studies
Curated by ChEMBL
LigandPNGBDBM50188185((4S,7S,10S,13S,16S,17R)-16-{[(2S)-2-(aminomethyl)p...)
Affinity DataIC50:  155nM. Assay description: Displacement of [3H]DAMGO from mu opioid receptor in rat brain homogenate
In DepthDetails ArticlePubMed