BDBM50188193 4-[(2S)-2-amino-3-{ethyl[(2S)-1-{ethyl[(2S)-1-[(2S)-2-[(ethylamino)methyl]pyrrolidin-1-yl]-3-phenylpropan-2-yl]amino}-3-(4-hydroxyphenyl)propan-2-yl]amino}propyl]phenol::CHEMBL214581
SMILES CCNC[C@@H]1CCCN1C[C@H](Cc1ccccc1)N(CC)C[C@H](Cc1ccc(O)cc1)N(CC)C[C@@H](N)Cc1ccc(O)cc1
InChI Key InChIKey=RAUSFOOIAODGPX-ZYADHFCISA-N
Data  1 IC50
  Tab Delimited (TSV)   2D SDfile   Computed 3D by Vconf -m prep SDfile
Find this compound or compounds like it in BindingDB:
Activity Spreadsheet -- Enzyme Inhibition Constant Data from BindingDB
Found 1 hit for monomerid = 50188193
TargetMu-type opioid receptor(GUINEA PIG)
Institute For Molecular Studies
Curated by ChEMBL
LigandPNGBDBM50188193(4-[(2S)-2-amino-3-{ethyl[(2S)-1-{ethyl[(2S)-1-[(2S...)
Affinity DataIC50:  45nM. Assay description: Antagonist activity against mu opioid receptor in guinea-pig ileum assay
In DepthDetails ArticlePubMed