BDBM50188800 CHEMBL386657::ammonium N-{4-[3-methoxy-2-(methoxycarbonyl)-2-{[4-(methoxycarbonyl)phenyl]methyl}-3-oxopropyl]phenyl}sulfamate
SMILES COC(=O)c1ccc(CC(Cc2ccc(NS([O-])(=O)=O)cc2)(C(=O)OC)C(=O)OC)cc1
InChI Key InChIKey=DCKLNPRUPYSHTG-UHFFFAOYSA-M
Data  1 IC50
  Tab Delimited (TSV)   2D SDfile   Computed 3D by Vconf -m prep SDfile
Find this compound or compounds like it in BindingDB:
Activity Spreadsheet -- Enzyme Inhibition Constant Data from BindingDB
Found 1 hit for monomerid = 50188800
TargetReceptor-type tyrosine-protein phosphatase beta(Homo sapiens (Human))
Procter & Gamble Pharmaceuticals
Curated by ChEMBL
LigandPNGBDBM50188800(CHEMBL386657 | ammonium N-{4-[3-methoxy-2-(methoxy...)
Affinity DataIC50:  410nM. Assay description: Inhibition of HPTPbeta
In DepthDetails ArticlePubMed