BDBM50189595 3-{[3-(trifluoromethyl)phenyl]azamethylene}benzo[d]azolidin-2-one::CHEMBL209480
SMILES FC(F)(F)c1cccc(c1)\N=C1\C(=O)Nc2ccccc12
InChI Key InChIKey=BNSKFCOAYKYHCS-UHFFFAOYSA-N
Data  1 KI
  Tab Delimited (TSV)   2D SDfile   Computed 3D by Vconf -m prep SDfile
Find this compound or compounds like it in BindingDB:
Activity Spreadsheet -- Enzyme Inhibition Constant Data from BindingDB
Found 1 hit for monomerid = 50189595
TargetGalanin receptor type 3(Homo sapiens (Human))
Lundbeck Research Usa
Curated by ChEMBL
LigandPNGBDBM50189595(3-{[3-(trifluoromethyl)phenyl]azamethylene}benzo[d...)
Affinity DataKi:  596nM. Assay description: Displacement of [125I]galanin from human GAL3
In DepthDetails ArticlePubMed